Reaction Details
TargetProstaglandin F2-alpha receptor
LigandBDBM82094
Substrate/Competitorn/a
Ki 60±n/a nM
CommentsPDSP_1464
Citation Kiriyama, MUshikubi, FKobayashi, THirata, MSugimoto, YNarumiya, S Ligand binding specificities of the eight types and subtypes of the mouse prostanoid receptors expressed in Chinese hamster ovary cells. Br J Pharmacol122:217-24 (1997) 
 
Prostaglandin F2-alpha receptor
Name:Prostaglandin F2-alpha receptor
Type:Enzyme Catalytic Domain
Mol. Mass.:40714.02
Organism:MOUSE
Description:ProstaglandinF2Alpha PTGFR MOUSE::P43117
Residue:366
BDBM82094
NameBDBM82094
Synonyms:17-PHENYL TRINOR PROSTAGLANDIN E2 PGE2,17-Phenyl
TypeSmall organic molecule
Emp. Form.C23H30O5
Mol. Mass.386.4813
SMILESO[C@@H](CCc1ccccc1)\C=C\[C@H]1[C@H](O)CC(=O)[C@@H]1C\C=C/CCCC(O)=O