Reaction Details
TargetThromboxane-A synthase
LigandBDBM81948
Substrate/Competitorn/a
Ki 14±n/a nM
CommentsPDSP_1772
Citation Kiriyama, MUshikubi, FKobayashi, THirata, MSugimoto, YNarumiya, S Ligand binding specificities of the eight types and subtypes of the mouse prostanoid receptors expressed in Chinese hamster ovary cells. Br J Pharmacol122:217-24 (1997) 
 
Thromboxane-A synthase
Name:Thromboxane-A synthase
Type:Enzyme Catalytic Domain
Mol. Mass.:60395.39
Organism:MOUSE
Description:Thromboxane Alpha 0 MOUSE::P36423
Residue:533
BDBM81948
NameBDBM81948
Synonyms:CAS_89617-02-7 ONO-11113 | STA2
TypeSmall organic molecule
Emp. Form.C21H34O3S
Mol. Mass.366.558
SMILESCCCCC[C@H](O)\C=C\C1C[C@H]2C[C@H](S2)[C@@H]1C\C=C/CCCC(O)=O