Reaction Details
TargetThromboxane-A synthase
LigandBDBM50018531
Substrate/Competitorn/a
Ki 67±n/a nM
CommentsPDSP_1934
Citation Kiriyama, MUshikubi, FKobayashi, THirata, MSugimoto, YNarumiya, S Ligand binding specificities of the eight types and subtypes of the mouse prostanoid receptors expressed in Chinese hamster ovary cells. Br J Pharmacol122:217-24 (1997) 
 
Thromboxane-A synthase
Name:Thromboxane-A synthase
Type:Enzyme Catalytic Domain
Mol. Mass.:60395.39
Organism:MOUSE
Description:Thromboxane Alpha 0 MOUSE::P36423
Residue:533
BDBM50018531
NameBDBM50018531
Synonyms:(Z)-7-[(S)-6-((E)-(S)-3-Hydroxy-oct-1-enyl)-2-oxa-bicyclo[2.2.1]hept-5-yl]-hept-5-enoic acid CHEMBL73010 U46619
TypeSmall organic molecule
Emp. Form.C21H34O4
Mol. Mass.350.4923
SMILESCCCCC[C@H](O)\C=C\C1[C@H]2C[C@H](CO2)[C@@H]1C\C=C/CCCC(O)=O