Reaction Details
TargetGamma-aminobutyric acid receptor subunit alpha-1
LigandBDBM23183
Substrate/Competitorn/a
Ki 8.4±n/a nM
CommentsPDSP_1260
Citation Ebert, BThompson, SASaounatsou, KMcKernan, RKrogsgaard-Larsen, PWafford, KA Differences in agonist/antagonist binding affinity and receptor transduction using recombinant human gamma-aminobutyric acid type A receptors. Mol Pharmacol52:1150-6 (1997) Gamma-aminobutyric acid receptor subunit alpha-1
Name:Gamma-aminobutyric acid receptor subunit alpha-1
Type:Protein
Mol. Mass.:51817.35
Organism:Homo sapiens (Human)
Description:P14867
Residue:456
BDBM23183
NameBDBM23183
Synonyms:5-(aminomethyl)-1,2-oxazol-3-ol CHEMBL273481 Pantherine
TypeGABA Agonist
Emp. Form.C4H6N2O2
Mol. Mass.114.1026
SMILESNCc1cc(=O)[nH]o1