Reaction Details
TargetGamma-aminobutyric acid receptor subunit alpha-3
LigandBDBM85196
Substrate/Competitorn/a
Ki 37.15±n/a nM
CommentsPDSP_1846
Citation Ebert, BThompson, SASaounatsou, KMcKernan, RKrogsgaard-Larsen, PWafford, KA Differences in agonist/antagonist binding affinity and receptor transduction using recombinant human gamma-aminobutyric acid type A receptors. Mol Pharmacol52:1150-6 (1997) Gamma-aminobutyric acid receptor subunit alpha-3
Name:Gamma-aminobutyric acid receptor subunit alpha-3
Type:Enzyme Catalytic Domain
Mol. Mass.:55175.47
Organism:Homo sapiens (Human)
Description:GABA A Alpha3Beta1Gamma2 0 HUMAN::P34903
Residue:492
BDBM85196
NameBDBM85196
Synonyms:CAS_5448 Thiomuscimol
TypeSmall organic molecule
Emp. Form.C4H6N2OS
Mol. Mass.130.168
SMILESNCc1cc(=O)[nH]s1