Reaction Details
TargetSodium-dependent serotonin transporter
LigandBDBM50254790
Substrate/Competitorn/a
Ki 2.3±n/a nM
CommentsPDSP_1361
Citation Owens, MJMorgan, WNPlott, SJNemeroff, CB Neurotransmitter receptor and transporter binding profile of antidepressants and their metabolites. J Pharmacol Exp Ther283:1305-22 (1997) Sodium-dependent serotonin transporter
Name:Sodium-dependent serotonin transporter
Type:Multi-pass membrane protein
Mol. Mass.:70322.51
Organism:Homo sapiens (Human)
Description:P31645
Residue:630
BDBM50254790
NameBDBM50254790
Synonyms:(S)-Norfluoxetine NORFLUOXETINE
TypeSmall organic molecule
Emp. Form.C16H16F3NO
Mol. Mass.295.2995
SMILESNCC[C@H](Oc1ccc(cc1)C(F)(F)F)c1ccccc1