Reaction Details
Target5-hydroxytryptamine receptor 1A
LigandBDBM85197
Substrate/Competitorn/a
Ki 1371±n/a nM
CommentsPDSP_1907
Citation Owens, MJMorgan, WNPlott, SJNemeroff, CB Neurotransmitter receptor and transporter binding profile of antidepressants and their metabolites. J Pharmacol Exp Ther283:1305-22 (1997) 5-hydroxytryptamine receptor 1A
Name:5-hydroxytryptamine receptor 1A
Type:G Protein-Coupled Receptor (GPCR)
Mol. Mass.:46445.29
Organism:Rattus norvegicus (rat)
Description:Binding assays were performed using rat hippocampal membranes.
Residue:422
BDBM85197
NameBDBM85197
Synonyms:Triazoledione
TypeSmall organic molecule
Emp. Form.C23H28ClN5O3
Mol. Mass.457.953
SMILESClc1cccc(c1)N1CCN(CCCn2[nH]c(=O)n(CCOc3ccccc3)c2=O)CC1