Reaction Details
Target5-hydroxytryptamine receptor 2A
LigandBDBM50001915
Substrate/Competitorn/a
Ki 110±n/a nM
CommentsPDSP_1168
Citation Owens, MJMorgan, WNPlott, SJNemeroff, CB Neurotransmitter receptor and transporter binding profile of antidepressants and their metabolites. J Pharmacol Exp Ther283:1305-22 (1997) 5-hydroxytryptamine receptor 2A
Name:5-hydroxytryptamine receptor 2A
Type:G Protein-Coupled Receptor (GPCR)
Mol. Mass.:52852.05
Organism:Rattus norvegicus (rat)
Description:Rat cortex membranes 5-HT2A receptors.
Residue:471
BDBM50001915
NameBDBM50001915
Synonyms:1-(3-chlorophenyl)piperazine m-Chlorophenylpiperazine | mCPP
TypeSmall organic molecule
Emp. Form.C10H13ClN2
Mol. Mass.196.677
SMILESClc1cccc(c1)N1CCNCC1