Reaction Details
Target5-hydroxytryptamine receptor 2A
LigandBDBM85197
Substrate/Competitorn/a
Ki 159±n/a nM
CommentsPDSP_1907
Citation Owens, MJMorgan, WNPlott, SJNemeroff, CB Neurotransmitter receptor and transporter binding profile of antidepressants and their metabolites. J Pharmacol Exp Ther283:1305-22 (1997) 5-hydroxytryptamine receptor 2A
Name:5-hydroxytryptamine receptor 2A
Type:G Protein-Coupled Receptor (GPCR)
Mol. Mass.:52852.05
Organism:Rattus norvegicus (rat)
Description:Rat cortex membranes 5-HT2A receptors.
Residue:471
BDBM85197
NameBDBM85197
Synonyms:Triazoledione
TypeSmall organic molecule
Emp. Form.C23H28ClN5O3
Mol. Mass.457.953
SMILESClc1cccc(c1)N1CCN(CCCn2[nH]c(=O)n(CCOc3ccccc3)c2=O)CC1