Reaction Details
TargetAlpha-2A adrenergic receptor
LigandBDBM50020712
Substrate/Competitorn/a
Ki 114±n/a nM
CommentsPDSP_288
Citation Owens, MJMorgan, WNPlott, SJNemeroff, CB Neurotransmitter receptor and transporter binding profile of antidepressants and their metabolites. J Pharmacol Exp Ther283:1305-22 (1997) Alpha-2A adrenergic receptor
Name:Alpha-2A adrenergic receptor
Type:Enzyme
Mol. Mass.:48979.91
Organism:Homo sapiens (Human)
Description:P08913
Residue:465
BDBM50020712
NameBDBM50020712
Synonyms:10,11-dihydro-5-(gamma-dimethylaminopropylidene)-5H-dibenzo(a,d)cycloheptene 3-(10,11-dihydro-5H-dibenzo(a,d)cyclohepten-5-ylidene)-N,N-dimethyl-1-propanamine 3-(10,11-dihydro-5H-dibenzo[a,d]cyclohepten-5-ylidene)-N,N-dimethylpropan-1-amine 5-(3-dimethylaminopropylidene)-10,11-dihydro-5H-dibenzo(a,d)cycloheptene AMITRIPTYLINE CHEMBL629
TypeSmall organic molecule
Emp. Form.C20H23N
Mol. Mass.277.4033
SMILES[#6]-[#7](-[#6])-[#6]-[#6]\[#6]=[#6]-1/c2ccccc2-[#6]-[#6]-c2ccccc-12