Reaction Details
TargetAlpha-2A adrenergic receptor
LigandBDBM82071
Substrate/Competitorn/a
Ki>10000±n/a nM
CommentsPDSP_1947
Citation Owens, MJMorgan, WNPlott, SJNemeroff, CB Neurotransmitter receptor and transporter binding profile of antidepressants and their metabolites. J Pharmacol Exp Ther283:1305-22 (1997) Alpha-2A adrenergic receptor
Name:Alpha-2A adrenergic receptor
Type:Enzyme
Mol. Mass.:48979.91
Organism:Homo sapiens (Human)
Description:P08913
Residue:450
BDBM82071
NameBDBM82071
Synonyms:CAS_93413-69-5 NSC_62923 Venlafaxine hydrochloride WY-45655
TypeSmall organic molecule
Emp. Form.C17H27NO2
Mol. Mass.277.4018
SMILESCOc1ccc(cc1)C(CN(C)C)C1(O)CCCCC1