Reaction Details
TargetSodium-dependent noradrenaline transporter
LigandBDBM25870
Substrate/Competitorn/a
Ki 7865±n/a nM
CommentsPDSP_532
Citation Owens, MJMorgan, WNPlott, SJNemeroff, CB Neurotransmitter receptor and transporter binding profile of antidepressants and their metabolites. J Pharmacol Exp Ther283:1305-22 (1997) Sodium-dependent noradrenaline transporter
Name:Sodium-dependent noradrenaline transporter
Type:Multi-pass membrane protein
Mol. Mass.:69337.72
Organism:Homo sapiens (Human)
Description:P23975
Residue:617
BDBM25870
NameBDBM25870
Synonyms:1-[3-(dimethylamino)propyl]-1-(4-fluorophenyl)-1,3-dihydro-2-benzofuran-5-carbonitrile CITALOPRAM Escitalopram [3H]Cytalopram [3H]Lexapro
Typeradiolabeled ligand
Emp. Form.C20H21FN2O
Mol. Mass.324.3919
SMILESCN(C)CCCC1(OCc2cc(ccc12)C#N)c1ccc(F)cc1