Reaction Details
TargetSodium-dependent noradrenaline transporter
LigandBDBM30130
Substrate/Competitorn/a
Ki 777±n/a nM
CommentsPDSP_830
Citation Owens, MJMorgan, WNPlott, SJNemeroff, CB Neurotransmitter receptor and transporter binding profile of antidepressants and their metabolites. J Pharmacol Exp Ther283:1305-22 (1997) Sodium-dependent noradrenaline transporter
Name:Sodium-dependent noradrenaline transporter
Type:Multi-pass membrane protein
Mol. Mass.:69337.72
Organism:Homo sapiens (Human)
Description:P23975
Residue:617
BDBM30130
NameBDBM30130
Synonyms:CHEMBL1201082 Fluoxetin Prozac cid_62857
TypeSmall organic molecule
Emp. Form.C17H18F3NO
Mol. Mass.309.3261
SMILESCNCCC(Oc1ccc(cc1)C(F)(F)F)c1ccccc1