Reaction Details
TargetNorepinephrine transporter
LigandBDBM50010859
Substrate/Competitorn/a
Ki 11±n/a nM
CommentsPDSP_973
Citation Owens, MJMorgan, WNPlott, SJNemeroff, CB Neurotransmitter receptor and transporter binding profile of antidepressants and their metabolites. J Pharmacol Exp Ther283:1305-22 (1997) Norepinephrine transporter
Name:Norepinephrine transporter
Synonyms:n/a
Type:Enzyme Catalytic Domain
Mol. Mass.:2082.45
Organism:RAT
Description:Norepinephrine transporter 0 RAT::Q9JIA2
Residue:19
MLLARMKPQVQPELGGADQ
BDBM50010859
NameBDBM50010859
TypeSmall organic molecule
Emp. Form.C19H24N2
Mol. Mass.280.4073
SMILESCN(C)CCCN1c2ccccc2CCc2ccccc12