Reaction Details
Target5-hydroxytryptamine receptor 7
LigandBDBM50001885
Substrate/Competitorn/a
Ki 1.6±n/a nM
CommentsPDSP_1599
Citation Arnt, JSkarsfeldt, T Do novel antipsychotics have similar pharmacological characteristics? A review of the evidence. Neuropsychopharmacology18:63-101 (1998) 
 
5-hydroxytryptamine receptor 7
Name:5-hydroxytryptamine receptor 7
Type:Enzyme
Mol. Mass.:49932.71
Organism:Mus musculus (Mouse)
Description:P32304
Residue:448
BDBM50001885
NameBDBM50001885
Synonyms:(risperidone)3-{2-[4-(6-Fluoro-benzo[d]isoxazol-3-yl)-piperidin-1-yl]-ethyl}-2-methyl-6,7,8,9-tetrahydro-pyrido[1,2-a]pyrimidin-4-one 2-(2-(4-(benzo[d]isoxazol-3-yl)piperidin-1-yl)ethyl)-7,8,9,9a-tetrahydro-1H-pyrido[1,2-a]pyrimidin-4(6H)-one 3-(2-(4-(6-fluorobenzo[d]isoxazol-3-yl)piperidin-1-yl)ethyl)-2-methyl-6,7,8,9-tetrahydropyrido[1,2-a]pyrimidin-4-one 3-{2-[4-(6-Fluoro-benzo[d]isoxazol-3-yl)-piperidin-1-yl]-ethyl}-2-methyl-6,7,8,9-tetrahydro-pyrido[1,2-a]pyrimidin-4-one (Resperidone) 3-{2-[4-(6-Fluoro-benzo[d]isoxazol-3-yl)-piperidin-1-yl]-ethyl}-2-methyl-6,7,8,9-tetrahydro-pyrido[1,2-a]pyrimidin-4-one(risperidone) CHEMBL85 RISPERDAL US10167256, Risperidone US10259786, Risperidone US8802672, Risperidone | WO2023288027, Cmpd Risperidone
TypeSmall organic molecule
Emp. Form.C23H27FN4O2
Mol. Mass.410.4845
SMILESCc1nc2CCCCn2c(=O)c1CCN1CCC(CC1)c1noc2cc(F)ccc12