Reaction Details
TargetCathepsin D
LigandBDBM50055925
Substrate/Competitorn/a
Meas. Tech. In-Vitro Fluorescence Assay
pH5.5±n/a
Temperature298.15±n/a K
IC50 8.60±n/a nM
Commentsextracted
Citation Tsaklakidis, CKlein, MCzodrowski, P Acylguanidines for treating osteoarthritis US Patent US9884814 Publication Date 2/6/2018
 
Cathepsin D
Name:Cathepsin D
Type:Enzyme
Mol. Mass.:44551.72
Organism:Homo sapiens (Human)
Description:Human proCathepsin D (SwissProt accession number P07339) was expressed in Sf9 cells, purified, and autoactivated.
Residue:412
BDBM50055925
NameBDBM50055925
Synonyms:CHEMBL3321939 | US9884814, Compound 99
TypeSmall organic molecule
Emp. Form.C28H36BrFN4O5
Mol. Mass.607.512
SMILESCOc1cc(CNC(=O)[C@@H](CC2CCCCC2)NC(=N)NC(=O)Cc2cc(OC)c(OC)cc2Br)ccc1F