Reaction Details
TargetGamma-aminobutyric acid receptor subunit alpha-1
LigandBDBM25878
Substrate/Competitorn/a
Ki 3136±n/a nM
CommentsPDSP_828
Citation Yamagishi, HKawaguchi, M Characterization of central- and peripheral-type benzodiazepine receptors in rat salivary glands. Biochem Pharmacol55:209-14 (1998) 
 
Gamma-aminobutyric acid receptor subunit alpha-1
Name:Gamma-aminobutyric acid receptor subunit alpha-1
Type:Enzyme
Mol. Mass.:51770.21
Organism:Rattus norvegicus (Rat)
Description:P62813
Residue:455
BDBM25878
NameBDBM25878
Synonyms:5-(2-fluorophenyl)-1-methyl-7-nitro-2,3-dihydro-1H-1,4-benzodiazepin-2-one Flunitrazepam [3H]flunitrazepam
Typeradiolabeled ligand
Emp. Form.C16H12FN3O3
Mol. Mass.313.2832
SMILESCN1c2ccc(cc2C(=NCC1=O)c1ccccc1F)[N+]([O-])=O