Reaction Details
TargetMuscarinic acetylcholine receptor M2
LigandBDBM85206
Substrate/Competitorn/a
Ki 11±n/a nM
CommentsPDSP_920
Citation Kovacs, IYamamura, HIWaite, SLVarga, EVRoeske, WR Pharmacological comparison of the cloned human and rat M2 muscarinic receptor genes expressed in the murine fibroblast (B82) cell line. J Pharmacol Exp Ther284:500-7 (1998) Muscarinic acetylcholine receptor M2
Name:Muscarinic acetylcholine receptor M2
Type:GPCR
Mol. Mass.:51730.61
Organism:Homo sapiens (Human)
Description:P08172
Residue:466
BDBM85206
NameBDBM85206
Synonyms:CAS_312-45-8 NSC_9399
TypeSmall organic molecule
Emp. Form.C24H34N2O4
Mol. Mass.414.5367
SMILESC[N+]1(C)CCOC(O)(C1)c1ccc(cc1)-c1ccc(cc1)C1(O)C[N+](C)(C)CCO1