Reaction Details
TargetMuscarinic acetylcholine receptor M2
LigandBDBM50004665
Substrate/Competitorn/a
Ki 290±n/a nM
CommentsPDSP_1426
Citation Kovacs, IYamamura, HIWaite, SLVarga, EVRoeske, WR Pharmacological comparison of the cloned human and rat M2 muscarinic receptor genes expressed in the murine fibroblast (B82) cell line. J Pharmacol Exp Ther284:500-7 (1998) Muscarinic acetylcholine receptor M2
Name:Muscarinic acetylcholine receptor M2
Type:Enzyme Catalytic Domain
Mol. Mass.:51555.53
Organism:RAT
Description:P10980
Residue:466
BDBM50004665
NameBDBM50004665
Synonyms:(oxotremorine)1-(4-Pyrrolidin-1-yl-but-2-ynyl)-pyrrolidin-2-one 1-(4-Pyrrolidin-1-yl-but-2-ynyl)-pyrrolidin-2-one (oxotremorphine) 1-[4-(2-oxo-pyrrolidin-1-yl)-but-2-ynyl]-pyrrolidinium Oxotremorine cid_4630
TypeSmall organic molecule
Emp. Form.C12H18N2O
Mol. Mass.206.2841
SMILESO=C1CCCN1CC#CCN1CCCC1