Reaction Details
Target5-hydroxytryptamine receptor 2A
LigandBDBM21280
Substrate/Competitorn/a
Ki>10000±n/a nM
CommentsPDSP_1751
Citation Rinaldi-Carmona, MBarth, FMillan, JDerocq, JMCasellas, PCongy, COustric, DSarran, MBouaboula, MCalandra, BPortier, MShire, DBrelière, JCLe Fur, GL SR 144528, the first potent and selective antagonist of the CB2 cannabinoid receptor. J Pharmacol Exp Ther284:644-50 (1998) 5-hydroxytryptamine receptor 2A
Name:5-hydroxytryptamine receptor 2A
Type:undefined
Mol. Mass.:52607.65
Organism:Homo sapiens (Human)
Description:P28223
Residue:471
BDBM21280
NameBDBM21280
Synonyms:5-(4-chloro-3-methylphenyl)-1-[(4-methylphenyl)methyl]-N-[(1S)-1,3,3-trimethylbicyclo[2.2.1]heptan-2-yl]-1H-pyrazole-3-carboxamide SR 144528 SR144528
TypeSmall organic molecule
Emp. Form.C29H34ClN3O
Mol. Mass.476.053
SMILESCc1ccc(Cn2nc(cc2-c2ccc(Cl)c(C)c2)C(=O)NC2[C@@]3(C)CCC(C3)C2(C)C)cc1