Reaction Details
TargetNeuronal acetylcholine receptor subunit alpha-3
LigandBDBM50049757
Substrate/Competitorn/a
Ki 151±n/a nM
CommentsPDSP_787
Citation Stauderman, KAMahaffy, LSAkong, MVeliçelebi, GChavez-Noriega, LECrona, JHJohnson, ECElliott, KJGillespie, AReid, RTAdams, PHarpold, MMCorey-Naeve, J Characterization of human recombinant neuronal nicotinic acetylcholine receptor subunit combinations alpha2beta4, alpha3beta4 and alpha4beta4 stably expressed in HEK293 cells. J Pharmacol Exp Ther284:777-89 (1998) Neuronal acetylcholine receptor subunit alpha-3
Name:Neuronal acetylcholine receptor subunit alpha-3
Type:Enzyme Catalytic Domain
Mol. Mass.:57479.03
Organism:Homo sapiens (Human)
Description:Cholinergic, Nicotinic Alpha3Beta2 0 HUMAN::P32297
Residue:505
BDBM50049757
NameBDBM50049757
Synonyms:()-2-(6-Chloro-pyridin-3-yl)-7-aza-bicyclo[2.2.1]heptane (+)-epibatidine (1R,2R,4S)-epibatidine (2R,4S)-2-(6-Chloro-pyridin-3-yl)-7-aza-bicyclo[2.2.1]heptane (2R,4S)-2-(6-chloropyridin-3-yl)-7-aza-bicyclo[2.2.1]heptane (R)-2-(6-Chloro-pyridin-3-yl)-7-methyl-7-aza-bicyclo[2.2.1]heptane 2-(6-Chloro-pyridin-3-yl)-7-aza-bicyclo[2.2.1]heptane 2-(6-Chloro-pyridin-3-yl)-7-aza-bicyclo[2.2.1]heptane(+/-) epibatidine 2-(6-Chloro-pyridin-3-yl)-7-azonia-bicyclo[2.2.1]heptane 2-Pyridin-3-yl-7-aza-bicyclo[2.2.1]heptane EPIBATIDINE Epibatidine-(+) exo-2-(6-chloropyridin-3-yl)-7-aza-bicyclo[2.2.1]heptane | rac-(2R)-2-(6-chloropyridin-3-yl)-7-aza-bicyclo[2.2.1]heptane
TypeSmall organic molecule
Emp. Form.C11H13ClN2
Mol. Mass.208.687
SMILESClc1ccc(cn1)C1CC2CCC1N2