Reaction Details
TargetNeuronal acetylcholine receptor subunit alpha-3
LigandBDBM85207
Substrate/Competitorn/a
Ki>10000±n/a nM
CommentsPDSP_1773
Citation Stauderman, KAMahaffy, LSAkong, MVeliçelebi, GChavez-Noriega, LECrona, JHJohnson, ECElliott, KJGillespie, AReid, RTAdams, PHarpold, MMCorey-Naeve, J Characterization of human recombinant neuronal nicotinic acetylcholine receptor subunit combinations alpha2beta4, alpha3beta4 and alpha4beta4 stably expressed in HEK293 cells. J Pharmacol Exp Ther284:777-89 (1998) Neuronal acetylcholine receptor subunit alpha-3
Name:Neuronal acetylcholine receptor subunit alpha-3
Type:Enzyme Catalytic Domain
Mol. Mass.:57479.03
Organism:Homo sapiens (Human)
Description:Cholinergic, Nicotinic Alpha3Beta2 0 HUMAN::P32297
Residue:505
BDBM85207
NameBDBM85207
Synonyms:CAS_123990 Suberyldicholine
TypeSmall organic molecule
Emp. Form.C18H38N2O4
Mol. Mass.346.5042
SMILESC[N+](C)(C)CCOC(=O)CCCCCCC(=O)OCC[N+](C)(C)C