Reaction Details
TargetAdenosine receptor A1
LigandBDBM50041905
Substrate/Competitorn/a
Ki 2.5±n/a nM
CommentsPDSP_2622
Citation Camaioni, EDi Francesco, EVittori, SVolpini, RCristalli, G Adenosine receptor agonists: synthesis and biological evaluation of the diastereoisomers of 2-(3-hydroxy-3-phenyl-1-propyn-1-yl)NECA. Bioorg Med Chem5:2267-75 (1997) 
 
Adenosine receptor A1
Name:Adenosine receptor A1
Type:Protein
Mol. Mass.:36704.13
Organism:Rattus norvegicus (rat)
Description:n/a
Residue:326
BDBM50041905
NameBDBM50041905
Synonyms:5-[6-Amino-2-(3-hydroxy-3-phenyl-prop-1-ynyl)-purin-9-yl]-3,4-dihydroxy-tetrahydro-furan-2-carboxylic acid ethylamide 6, PHPNECA | R,S-PHPNECA
TypeSmall organic molecule
Emp. Form.C21H22N6O5
Mol. Mass.438.4366
SMILESCCNC(=O)C1OC(C(O)C1O)n1cnc2c(N)nc(nc12)C#CC(O)c1ccccc1