Reaction Details
Target5-hydroxytryptamine receptor 2B
LigandBDBM50007407
Substrate/Competitorn/a
Ki 0.89±n/a nM
CommentsPDSP_32
Citation Wainscott, DBSasso, DAKursar, JDBaez, MLucaites, VLNelson, DL [3H]Rauwolscine: an antagonist radioligand for the cloned human 5-hydroxytryptamine2b (5-HT2B) receptor. Naunyn Schmiedebergs Arch Pharmacol357:17-24 (1998) 
 
5-hydroxytryptamine receptor 2B
Name:5-hydroxytryptamine receptor 2B
Type:G Protein-Coupled Receptor (GPCR)
Mol. Mass.:54312.47
Organism:Homo sapiens (Human)
Description:Receptor binding assays were performed using human clone stably expressed in CHO cells.
Residue:481
BDBM50007407
NameBDBM50007407
Synonyms:1-NP 4-Naphthalen-1-yl-piperazin-1-ium | CHEMBL277120
TypeSmall organic molecule
Emp. Form.C14H16N2
Mol. Mass.212.2902
SMILESC1CN(CCN1)c1cccc2ccccc12