Reaction Details
Target5-hydroxytryptamine receptor 2B
LigandBDBM35938
Substrate/Competitorn/a
Ki 4170±n/a nM
CommentsPDSP_161
Citation Wainscott, DBSasso, DAKursar, JDBaez, MLucaites, VLNelson, DL [3H]Rauwolscine: an antagonist radioligand for the cloned human 5-hydroxytryptamine2b (5-HT2B) receptor. Naunyn Schmiedebergs Arch Pharmacol357:17-24 (1998) 
 
5-hydroxytryptamine receptor 2B
Name:5-hydroxytryptamine receptor 2B
Type:G Protein-Coupled Receptor (GPCR)
Mol. Mass.:54312.47
Organism:Homo sapiens (Human)
Description:Receptor binding assays were performed using human clone stably expressed in CHO cells.
Residue:481
BDBM35938
NameBDBM35938
Synonyms:1-(p-chlorophenyl)-1-(2-pyridyl)-3-N,N-dimethylpropylamine 3-(p-chlorophenyl)-3-(2-pyridyl)-N,N-dimethylpropylamine CHEMBL505 CHLORPHENIRAMINE MALEATE Polaramine [3H]Chlorphenamine chlorophenylpyridamine clorfeniramina gamma-(4-chlorophenyl)-N,N-dimethyl-2-pyridinepropanamine | gamma-(4-chlorophenyl)-gamma-(2-pyridyl)propyldimethylamine
Typeradiolabeled ligand
Emp. Form.C16H19ClN2
Mol. Mass.274.788
SMILESCN(C)CCC(c1ccc(Cl)cc1)c1ccccn1