Reaction Details
TargetGlutamate receptor ionotropic, NMDA 1
LigandBDBM50013055
Substrate/Competitorn/a
Ki 131±n/a nM
CommentsPDSP_2014
Citation Shimamoto, KLebrun, BYasuda-Kamatani, YSakaitani, MShigeri, YYumoto, NNakajima, T DL-threo-beta-benzyloxyaspartate, a potent blocker of excitatory amino acid transporters. Mol Pharmacol53:195-201 (1998) 
 
Glutamate receptor ionotropic, NMDA 1
Name:Glutamate receptor ionotropic, NMDA 1
Type:Enzyme Catalytic Domain
Mol. Mass.:105533.40
Organism:RAT
Description:P35439
Residue:938
BDBM50013055
NameBDBM50013055
Synonyms:2-aminopentanedioateglutamate glutamate(2-) | glutamic acid dianion
TypeSmall organic molecule
Emp. Form.C5H7NO4
Mol. Mass.145.1145
SMILESNC(CCC([O-])=O)C([O-])=O