Reaction Details
TargetGlutamate receptor 3
LigandBDBM50008692
Substrate/Competitorn/a
Ki>10000±n/a nM
CommentsPDSP_289
Citation Varney, MARao, SPJachec, CDeal, CHess, SDDaggett, LPLin, FJohnson, ECVeliçelebi, G Pharmacological characterization of the human ionotropic glutamate receptor subtype GluR3 stably expressed in mammalian cells. J Pharmacol Exp Ther285:358-70 (1998) Glutamate receptor 3
Name:Glutamate receptor 3
Type:Enzyme Catalytic Domain
Mol. Mass.:100383.57
Organism:RAT
Description:Glutamate-AMPA GRIA3 RAT::P19492
Residue:888
BDBM50008692
NameBDBM50008692
Synonyms:2-Amino-3-(3-carboxymethoxy-5-methyl-isoxazol-4-yl)-propionic acid(AMOA) | AMOA
TypeSmall organic molecule
Emp. Form.C9H11N2O6
Mol. Mass.243.194
SMILESCc1onc(OCC([O-])=O)c1CC([NH3+])C([O-])=O