Reaction Details
TargetGlutamate receptor 3
LigandBDBM85216
Substrate/Competitorn/a
Ki 494±n/a nM
CommentsPDSP_702
Citation Varney, MARao, SPJachec, CDeal, CHess, SDDaggett, LPLin, FJohnson, ECVeliçelebi, G Pharmacological characterization of the human ionotropic glutamate receptor subtype GluR3 stably expressed in mammalian cells. J Pharmacol Exp Ther285:358-70 (1998) Glutamate receptor 3
Name:Glutamate receptor 3
Type:PROTEIN
Mol. Mass.:101172.14
Organism:Homo sapiens (Human)
Description:ChEMBL_468627
Residue:894
BDBM85216
NameBDBM85216
Synonyms:Dnal,Cys,Tyr,DTrp,Lys,Val,Cys,Nal-nh2
TypeSmall organic molecule
Emp. Form.C63H75N11O9S2
Mol. Mass.1194.468
SMILESCC(C)[C@H](NC(=O)[C@@H](CCCCN)NC(=O)[C@H](Cc1c[nH]c2ccccc12)NC(=O)[C@@H](Cc1ccc(O)cc1)NC(=O)[C@H](CS)NC(=O)[C@H](N)Cc1ccc2ccccc2c1)C(=O)N[C@@H](CS)C(=O)N[C@@H](Cc1ccc2ccccc2c1)C(N)=O