Reaction Details
TargetGlutamate receptor 3
LigandBDBM85217
Substrate/Competitorn/a
Ki>10000±n/a nM
CommentsPDSP_869
Citation Varney, MARao, SPJachec, CDeal, CHess, SDDaggett, LPLin, FJohnson, ECVeliçelebi, G Pharmacological characterization of the human ionotropic glutamate receptor subtype GluR3 stably expressed in mammalian cells. J Pharmacol Exp Ther285:358-70 (1998) Glutamate receptor 3
Name:Glutamate receptor 3
Type:PROTEIN
Mol. Mass.:101172.14
Organism:Homo sapiens (Human)
Description:ChEMBL_468627
Residue:894
BDBM85217
NameBDBM85217
Synonyms:CAS_90237-02-8 NSC_119558
TypeSmall organic molecule
Emp. Form.C6H12N2O6S
Mol. Mass.240.234
SMILESNC(CCC(=O)NCS(O)(=O)=O)C(O)=O