Reaction Details
TargetGlutamate receptor 3
LigandBDBM85214
Substrate/Competitorn/a
Ki 21±n/a nM
CommentsPDSP_874
Citation Varney, MARao, SPJachec, CDeal, CHess, SDDaggett, LPLin, FJohnson, ECVeliçelebi, G Pharmacological characterization of the human ionotropic glutamate receptor subtype GluR3 stably expressed in mammalian cells. J Pharmacol Exp Ther285:358-70 (1998) Glutamate receptor 3
Name:Glutamate receptor 3
Type:PROTEIN
Mol. Mass.:101172.14
Organism:Homo sapiens (Human)
Description:ChEMBL_468627
Residue:894
BDBM85214
NameBDBM85214
Synonyms:glutamate-AMPA
TypeSmall organic molecule
Emp. Form.C7H10N2O4
Mol. Mass.186.1653
SMILESCc1o[nH]c(=O)c1C[C@H](N)C(O)=O