Reaction Details
TargetGlutamate receptor 3
LigandBDBM50289498
Substrate/Competitorn/a
Ki 122±n/a nM
CommentsPDSP_1293
Citation Varney, MARao, SPJachec, CDeal, CHess, SDDaggett, LPLin, FJohnson, ECVeliçelebi, G Pharmacological characterization of the human ionotropic glutamate receptor subtype GluR3 stably expressed in mammalian cells. J Pharmacol Exp Ther285:358-70 (1998) Glutamate receptor 3
Name:Glutamate receptor 3
Type:Enzyme Catalytic Domain
Mol. Mass.:100383.57
Organism:RAT
Description:Glutamate-AMPA GRIA3 RAT::P19492
Residue:888
BDBM50289498
NameBDBM50289498
Synonyms:3-Hydroxy-6-nitro-7-sulfamoyl-benzo[f]quinoxalin-2-ol anion | NBQX
TypeSmall organic molecule
Emp. Form.C12H7N4O6S
Mol. Mass.335.273
SMILESNS(=O)(=O)c1cccc2c1c(cc1[n-]c(=[OH+])c(=O)[n-]c21)[N+]([O-])=O