Reaction Details
TargetSodium-dependent serotonin transporter
LigandBDBM50079527
Substrate/Competitorn/a
Ki 68±n/a nM
CommentsPDSP_735
Citation Tatsumi, MGroshan, KBlakely, RDRichelson, E Pharmacological profile of antidepressants and related compounds at human monoamine transporters. Eur J Pharmacol340:249-58 (1997) 
 
Sodium-dependent serotonin transporter
Name:Sodium-dependent serotonin transporter
Type:Multi-pass membrane protein
Mol. Mass.:70322.51
Organism:Homo sapiens (Human)
Description:P31645
Residue:630
BDBM50079527
NameBDBM50079527
Synonyms:(3E)-3-dibenzo[b,e]oxepin-11(6H)-ylidene-N,N-dimethylpropan-1-amine(3Z)-3-dibenzo[b,e]oxepin-11(6H)-ylidene-N,N-dimethylpropan-1-amine DOXEPIN | cis-doxepin
TypeSmall organic molecule
Emp. Form.C19H21NO
Mol. Mass.279.3761
SMILESCN(C)CC\C=C1\c2ccccc2COc2ccccc12