Reaction Details
TargetSodium-dependent serotonin transporter
LigandBDBM50020706
Substrate/Competitorn/a
Ki 152±n/a nM
CommentsPDSP_1995
Citation Tatsumi, MGroshan, KBlakely, RDRichelson, E Pharmacological profile of antidepressants and related compounds at human monoamine transporters. Eur J Pharmacol340:249-58 (1997) 
 
Sodium-dependent serotonin transporter
Name:Sodium-dependent serotonin transporter
Type:Multi-pass membrane protein
Mol. Mass.:70322.51
Organism:Homo sapiens (Human)
Description:P31645
Residue:630
BDBM50020706
NameBDBM50020706
Synonyms:CHEMBL37744 Zimeldine [3-(4-Bromo-phenyl)-3-pyridin-3-yl-allyl]-dimethyl-amine (Zimelidine) cis -[3-(4-Bromo-phenyl)-3-pyridin-3-yl-allyl]-dimethyl-amine;HCl | trans-[3-(4-Bromo-phenyl)-3-pyridin-3-yl-allyl]-dimethyl-amine;C2H4O4
TypeSmall organic molecule
Emp. Form.C16H17BrN2
Mol. Mass.317.224
SMILESCN(C)C\C=C(\c1ccc(Br)cc1)c1cccnc1