Reaction Details
TargetSodium-dependent dopamine transporter
LigandBDBM50105417
Substrate/Competitorn/a
Ki 8400±n/a nM
CommentsPDSP_6530
Citation Tatsumi, MGroshan, KBlakely, RDRichelson, E Pharmacological profile of antidepressants and related compounds at human monoamine transporters. Eur J Pharmacol340:249-58 (1997) 
 
Sodium-dependent dopamine transporter
Name:Sodium-dependent dopamine transporter
Type:Multi-pass membrane protein
Mol. Mass.:68497.11
Organism:Homo sapiens (Human)
Description:Q01959
Residue:620
BDBM50105417
NameBDBM50105417
Synonyms:CHEMBL1089 PHENELZINE | Phenethyl-hydrazine
TypeSmall organic molecule
Emp. Form.C8H12N2
Mol. Mass.136.1943
SMILESNNCCc1ccccc1