Reaction Details
TargetSodium-dependent dopamine transporter
LigandBDBM82217
Substrate/Competitorn/a
Ki 25±n/a nM
CommentsPDSP_1710
Citation Tatsumi, MGroshan, KBlakely, RDRichelson, E Pharmacological profile of antidepressants and related compounds at human monoamine transporters. Eur J Pharmacol340:249-58 (1997) 
 
Sodium-dependent dopamine transporter
Name:Sodium-dependent dopamine transporter
Type:Multi-pass membrane protein
Mol. Mass.:68497.11
Organism:Homo sapiens (Human)
Description:Q01959
Residue:620
BDBM82217
NameBDBM82217
Synonyms:CHEMBL284994 SERTRALINE | [4-(3,4-Dichloro-phenyl)-1,2,3,4-tetrahydro-naphthalen-1-yl]-methyl-amine
Typen/a
Emp. Form.C17H17Cl2N
Mol. Mass.306.23
SMILESCN[C@@H]1CC[C@@H](c2ccc(Cl)c(Cl)c2)c2ccccc12