Reaction Details
TargetGlutamate receptor ionotropic, NMDA 1
LigandBDBM50080029
Substrate/Competitorn/a
Ki 6±n/a nM
CommentsPDSP_3237
Citation Mutel, VBuchy, DKlingelschmidt, AMesser, JBleuel, ZKemp, JARichards, JG In vitro binding properties in rat brain of [3H]Ro 25-6981, a potent and selective antagonist of NMDA receptors containing NR2B subunits. J Neurochem70:2147-55 (1998) 
 
Glutamate receptor ionotropic, NMDA 1
Name:Glutamate receptor ionotropic, NMDA 1
Type:Enzyme Catalytic Domain
Mol. Mass.:105533.40
Organism:RAT
Description:P35439
Residue:938
BDBM50080029
NameBDBM50080029
Synonyms:4-((1R,2S)-3-(4-benzylpiperidin-1-yl)-1-hydroxy-2-methylpropyl)phenol 4-[(R)-3-(4-Benzyl-piperidin-1-yl)-1-(S)-hydroxy-2-methyl-propyl]-phenol Ro 25-6981 | Ro-25-6981
TypeSmall organic molecule
Emp. Form.C22H29NO2
Mol. Mass.339.4712
SMILESC[C@@H](CN1CCC(Cc2ccccc2)CC1)[C@@H](O)c1ccc(O)cc1