Reaction Details
TargetD(2) dopamine receptor
LigandBDBM50130273
Substrate/Competitorn/a
Ki 0.16±n/a nM
CommentsPDSP_1456
Citation Seeman, PTallerico, T Antipsychotic drugs which elicit little or no parkinsonism bind more loosely than dopamine to brain D2 receptors, yet occupy high levels of these receptors. Mol Psychiatry3:123-34 (1998) 
 
D(2) dopamine receptor
Name:D(2) dopamine receptor
Type:Cell-surface receptors
Mol. Mass.:50647.10
Organism:Homo sapiens (Human)
Description:P14416
Residue:443
BDBM50130273
NameBDBM50130273
Synonyms:2-(4-[3-(2-chloro-10H-phenothiazin-10-yl)propyl]-1-piperazinyl)ethanol 2-{4-[3-(2-chloro-10H-phenothiazin-10-yl)propyl]piperazin-1-yl}ethanol 4-[3-(2-chlorophenothiazin-10-yl)propyl]-1-piperazineethanol Chlorpiprazine Perfenazine Trilafon | gamma-(4-(beta-hydroxyethyl)piperazin-1-yl)propyl-2-chlorophenothiazine
TypeSmall organic molecule
Emp. Form.C21H26ClN3OS
Mol. Mass.403.969
SMILESOCCN1CCN(CCCN2c3ccccc3Sc3ccc(Cl)cc23)CC1