Reaction Details
TargetD(4) dopamine receptor
LigandBDBM81493
Substrate/Competitorn/a
Ki 0.35±n/a nM
CommentsPDSP_2608
Citation Seeman, PTallerico, T Antipsychotic drugs which elicit little or no parkinsonism bind more loosely than dopamine to brain D2 receptors, yet occupy high levels of these receptors. Mol Psychiatry3:123-34 (1998) 
 
D(4) dopamine receptor
Name:D(4) dopamine receptor
Type:Enzyme
Mol. Mass.:48373.19
Organism:Homo sapiens (Human)
Description:P21917
Residue:419
BDBM81493
NameBDBM81493
Synonyms:CAS_749-13-3 | TRIFLUORPERIDOL
TypeSmall organic molecule
Emp. Form.C22H23F4NO2
Mol. Mass.409.4171
SMILESOC1(CCN(CC1)C(F)CCC(=O)c1ccccc1)c1cccc(c1)C(F)(F)F