Reaction Details
TargetSomatostatin receptor type 2
LigandBDBM82470
Substrate/Competitorn/a
Ki 0.75±n/a nM
CommentsPDSP_373
Citation Meyerhof, W The elucidation of somatostatin receptor functions: a current view. Rev Physiol Biochem Pharmacol133:55-108 (1998) 
 
Somatostatin receptor type 2
Name:Somatostatin receptor type 2
Type:Enzyme Catalytic Domain
Mol. Mass.:41234.26
Organism:MOUSE
Description:SOMATOSTATIN SST2 SSTR2 MOUSE::P30875
Residue:369
BDBM82470
NameBDBM82470
Synonyms:3-(2-Naphtyl)-D-Ala-L-Cys(1)-L-Tyr-D-Trp-L-Lys-L-Val-L-Cys(1)-L-Thr-NH2 BIM-23014 | LANREOTIDE
TypeSmall organic molecule
Emp. Form.C54H69N11O10S2
Mol. Mass.1096.323
SMILESCC(C)[C@@H]1NC(=O)[C@H](CCCCN)NC(=O)[C@@H](Cc2c[nH]c3ccccc23)NC(=O)[C@H](Cc2ccc(O)cc2)NC(=O)[C@H](CSSC[C@H](NC1=O)C(=O)N[C@@H]([C@@H](C)O)C(N)=O)NC(=O)[C@H](N)Cc1ccc2ccccc2c1