Reaction Details
TargetSomatostatin receptor type 3
LigandBDBM50063839
Substrate/Competitorn/a
Ki 4.1±n/a nM
CommentsPDSP_3365
Citation Meyerhof, W The elucidation of somatostatin receptor functions: a current view. Rev Physiol Biochem Pharmacol133:55-108 (1998) 
 
Somatostatin receptor type 3
Name:Somatostatin receptor type 3
Type:Enzyme Catalytic Domain
Mol. Mass.:47161.54
Organism:RAT
Description:SOMATOSTATIN SST3 SSTR3 RAT::P30936
Residue:428
BDBM50063839
NameBDBM50063839
Synonyms:BIM 23268 H-cyclo[DCys-Phe-Phe-DTrp-Lys-Thr-Phe-DCys]-NH2
TypeSmall organic molecule
Emp. Form.C54H67N11O9S2
Mol. Mass.1078.308
SMILESCC(O)[C@H]1NC(=O)[C@H](CCCCN)NC(=O)[C@H](Cc2c[nH]c3ccccc23)NC(=O)[C@H](Cc2ccccc2)NC(=O)[C@@H](Cc2ccccc2)NC(=O)[C@H](N)CSSC[C@@H](NC(=O)[C@H](Cc2ccccc2)NC1=O)C(N)=O