Reaction Details
TargetSomatostatin receptor type 5
LigandBDBM82465
Substrate/Competitorn/a
Ki 14±n/a nM
CommentsPDSP_374
Citation Meyerhof, W The elucidation of somatostatin receptor functions: a current view. Rev Physiol Biochem Pharmacol133:55-108 (1998) 
 
Somatostatin receptor type 5
Name:Somatostatin receptor type 5
Type:Enzyme Catalytic Domain
Mol. Mass.:39986.50
Organism:RAT
Description:SOMATOSTATIN SST5 SSTR5 RAT::P30938
Residue:363
BDBM82465
NameBDBM82465
Synonyms:BIM 23023 D-Phe-L-Cys(1)-L-Tyr-D-Trp-L-Lys-L-Abu-L-Cys(1)-L-Thr-NH2
TypeSmall organic molecule
Emp. Form.C49H65N11O10S2
Mol. Mass.1032.238
SMILESCC[C@@H]1NC(=O)[C@H](CCCCN)NC(=O)[C@@H](Cc2c[nH]c3ccccc23)NC(=O)[C@H](Cc2ccc(O)cc2)NC(=O)[C@H](CSSC[C@H](NC1=O)C(=O)N[C@@H]([C@@H](C)O)C(N)=O)NC(=O)[C@H](N)Cc1ccccc1