Reaction Details
TargetAlpha-2A adrenergic receptor
LigandBDBM50019729
Substrate/Competitorn/a
Ki 9.77±n/a nM
CommentsPDSP_5981
Citation Jasper, JRLesnick, JDChang, LKYamanishi, SSChang, TKHsu, SADaunt, DABonhaus, DWEglen, RM Ligand efficacy and potency at recombinant alpha2 adrenergic receptors: agonist-mediated [35S]GTPgammaS binding. Biochem Pharmacol55:1035-43 (1998) 
 
Alpha-2A adrenergic receptor
Name:Alpha-2A adrenergic receptor
Type:Enzyme Catalytic Domain
Mol. Mass.:48888.08
Organism:MOUSE
Description:adrenergic Alpha2A ADRA2A MOUSE::Q01338
Residue:450
BDBM50019729
NameBDBM50019729
Synonyms:(S)-5-(4,5-Dihydro-1H-imidazol-2-yl)-5,6,7,8-tetrahydro-naphthalene-1,2-diol CHEMBL7169
TypeSmall organic molecule
Emp. Form.C13H16N2O2
Mol. Mass.232.2783
SMILESOc1ccc2[C@H](CCCc2c1O)C1=NCCN1