Reaction Details
TargetAlpha-2A adrenergic receptor
LigandBDBM81979
Substrate/Competitorn/a
Ki 21.88±n/a nM
CommentsPDSP_914
Citation Jasper, JRLesnick, JDChang, LKYamanishi, SSChang, TKHsu, SADaunt, DABonhaus, DWEglen, RM Ligand efficacy and potency at recombinant alpha2 adrenergic receptors: agonist-mediated [35S]GTPgammaS binding. Biochem Pharmacol55:1035-43 (1998) 
 
Alpha-2A adrenergic receptor
Name:Alpha-2A adrenergic receptor
Type:Enzyme
Mol. Mass.:48979.91
Organism:Homo sapiens (Human)
Description:P08913
Residue:450
BDBM81979
NameBDBM81979
Synonyms:CAS_5051-62-7 Fluprofylline NSC_3517 | NSC_65636
TypeSmall organic molecule
Emp. Form.C8H8Cl2N4
Mol. Mass.231.082
SMILES[#7]\[#6](-[#7])=[#7]\[#7]=[#6]-c1c(Cl)cccc1Cl