Reaction Details
TargetAlpha-2A adrenergic receptor
LigandBDBM50001922
Substrate/Competitorn/a
Ki 11.48±n/a nM
CommentsPDSP_1290
Citation Jasper, JRLesnick, JDChang, LKYamanishi, SSChang, TKHsu, SADaunt, DABonhaus, DWEglen, RM Ligand efficacy and potency at recombinant alpha2 adrenergic receptors: agonist-mediated [35S]GTPgammaS binding. Biochem Pharmacol55:1035-43 (1998) 
 
Alpha-2A adrenergic receptor
Name:Alpha-2A adrenergic receptor
Type:Enzyme Catalytic Domain
Mol. Mass.:48888.08
Organism:MOUSE
Description:adrenergic Alpha2A ADRA2A MOUSE::Q01338
Residue:450
BDBM50001922
NameBDBM50001922
Synonyms:2-Naphthalen-1-ylmethyl-4,5-dihydro-1H-imidazole; hydrochloride CHEMBL1706 Nafazair Naphazoline Nitrate Opcon cid_11079
TypeSmall organic molecule
Emp. Form.C14H14N2
Mol. Mass.210.2744
SMILESC(C1=NCCN1)c1cccc2ccccc12