Reaction Details
TargetAlpha-2A adrenergic receptor
LigandBDBM30712
Substrate/Competitorn/a
Ki 25.70±n/a nM
CommentsPDSP_1428
Citation Jasper, JRLesnick, JDChang, LKYamanishi, SSChang, TKHsu, SADaunt, DABonhaus, DWEglen, RM Ligand efficacy and potency at recombinant alpha2 adrenergic receptors: agonist-mediated [35S]GTPgammaS binding. Biochem Pharmacol55:1035-43 (1998) 
 
Alpha-2A adrenergic receptor
Name:Alpha-2A adrenergic receptor
Type:Enzyme Catalytic Domain
Mol. Mass.:48888.08
Organism:MOUSE
Description:adrenergic Alpha2A ADRA2A MOUSE::Q01338
Residue:450
BDBM30712
NameBDBM30712
Synonyms:6-tert-butyl-3-(2-imidazolin-2-ylmethyl)-2,4-dimethyl-phenol;hydrochloride 6-tert-butyl-3-(4,5-dihydro-1H-imidazol-2-ylmethyl)-2,4-dimethylphenol;hydrochloride Oxymetazoline cid_66259
TypeSmall organic molecule
Emp. Form.C16H24N2O
Mol. Mass.260.3746
SMILESCc1cc(c(O)c(C)c1CC1=NCCN1)C(C)(C)C