Reaction Details
TargetAlpha-2A adrenergic receptor
LigandBDBM50262235
Substrate/Competitorn/a
Ki 724.44±n/a nM
CommentsPDSP_5980
Citation Jasper, JRLesnick, JDChang, LKYamanishi, SSChang, TKHsu, SADaunt, DABonhaus, DWEglen, RM Ligand efficacy and potency at recombinant alpha2 adrenergic receptors: agonist-mediated [35S]GTPgammaS binding. Biochem Pharmacol55:1035-43 (1998) 
 
Alpha-2A adrenergic receptor
Name:Alpha-2A adrenergic receptor
Type:Enzyme Catalytic Domain
Mol. Mass.:48888.08
Organism:MOUSE
Description:adrenergic Alpha2A ADRA2A MOUSE::Q01338
Residue:450
BDBM50262235
NameBDBM50262235
Synonyms:rilmenidine
TypeSmall organic molecule
Emp. Form.C10H17N2O
Mol. Mass.181.2542
SMILESC1CC1C(NC1=[NH+]CCO1)C1CC1