Reaction Details
TargetAlpha-2A adrenergic receptor
LigandBDBM34572
Substrate/Competitorn/a
Ki 213.80±n/a nM
CommentsPDSP_1943
Citation Jasper, JRLesnick, JDChang, LKYamanishi, SSChang, TKHsu, SADaunt, DABonhaus, DWEglen, RM Ligand efficacy and potency at recombinant alpha2 adrenergic receptors: agonist-mediated [35S]GTPgammaS binding. Biochem Pharmacol55:1035-43 (1998) 
 
Alpha-2A adrenergic receptor
Name:Alpha-2A adrenergic receptor
Type:Enzyme
Mol. Mass.:48979.91
Organism:Homo sapiens (Human)
Description:P08913
Residue:465
BDBM34572
NameBDBM34572
Synonyms:BRIMONIDINE MLS000069370 UK 14,304 | cid_2435
TypeSmall organic molecule
Emp. Form.C11H10BrN5
Mol. Mass.292.135
SMILESBrc1c(NC2=NCCN2)ccc2nccnc12