Reaction Details
TargetAlpha-2B adrenergic receptor
LigandBDBM50159249
Substrate/Competitorn/a
Ki 16.98±n/a nM
CommentsPDSP_5979
Citation Jasper, JRLesnick, JDChang, LKYamanishi, SSChang, TKHsu, SADaunt, DABonhaus, DWEglen, RM Ligand efficacy and potency at recombinant alpha2 adrenergic receptors: agonist-mediated [35S]GTPgammaS binding. Biochem Pharmacol55:1035-43 (1998) 
 
Alpha-2B adrenergic receptor
Name:Alpha-2B adrenergic receptor
Type:Enzyme
Mol. Mass.:49964.20
Organism:Homo sapiens (Human)
Description:P18089
Residue:450
BDBM50159249
NameBDBM50159249
Synonyms:CHEMBL16293 Naphthalin naftalina naphtaline | naphthalene
TypeSmall organic molecule
Emp. Form.C10H8
Mol. Mass.128.1705
SMILESc1ccc2ccccc2c1