Reaction Details
TargetAlpha-2B adrenergic receptor
LigandBDBM81926
Substrate/Competitorn/a
Ki 29.51±n/a nM
CommentsPDSP_1437
Citation Jasper, JRLesnick, JDChang, LKYamanishi, SSChang, TKHsu, SADaunt, DABonhaus, DWEglen, RM Ligand efficacy and potency at recombinant alpha2 adrenergic receptors: agonist-mediated [35S]GTPgammaS binding. Biochem Pharmacol55:1035-43 (1998) 
 
Alpha-2B adrenergic receptor
Name:Alpha-2B adrenergic receptor
Type:Enzyme
Mol. Mass.:49964.20
Organism:Homo sapiens (Human)
Description:P18089
Residue:450
BDBM81926
NameBDBM81926
Synonyms:Aminoclonidine, p NSC_51763 | p-AMINOCLONIDINE
TypeSmall organic molecule
Emp. Form.C9H10Cl2N4
Mol. Mass.245.109
SMILESNc1cc(Cl)c(NC2=NCCN2)c(Cl)c1