Reaction Details
TargetAlpha-2B adrenergic receptor
LigandBDBM50027069
Substrate/Competitorn/a
Ki 3467.37±n/a nM
CommentsPDSP_1979
Citation Jasper, JRLesnick, JDChang, LKYamanishi, SSChang, TKHsu, SADaunt, DABonhaus, DWEglen, RM Ligand efficacy and potency at recombinant alpha2 adrenergic receptors: agonist-mediated [35S]GTPgammaS binding. Biochem Pharmacol55:1035-43 (1998) 
 
Alpha-2B adrenergic receptor
Name:Alpha-2B adrenergic receptor
Type:Enzyme
Mol. Mass.:49964.20
Organism:Homo sapiens (Human)
Description:P18089
Residue:450
BDBM50027069
NameBDBM50027069
Synonyms:(2,6-Dimethyl-phenyl)-[1,3]thiazinan-2-ylidene-amine CHEMBL297362 | Xylazine
TypeSmall organic molecule
Emp. Form.C12H16N2S
Mol. Mass.220.334
SMILESCc1cccc(C)c1N=C1NCCCS1